Target
Tissue alpha-L-fucosidase
Ligand
BDBM50104411
Substrate
Meas. Tech.
ChEBML_33962
Ki
80000±n/a nM
Citation
 Dumas, DPKajimoto, TLiu, KKWong, CBerkowitz, DBDanieshefsky, SJ Azasugar and glycal inhibitors of -L-fucosidase Bioorg Med Chem Lett 2:33-36 (1992)    Article 
Target
Name:
Tissue alpha-L-fucosidase
Synonyms:
Alpha-L-fucosidase I FUCA1 Tissue alpha-L-fucosidase
Type:
PROTEIN
Mol. Mass.:
53690.69
Organism:
Homo sapiens (Human)
Description:
ChEMBL_34088
Residue:
466
  
Inhibitor
Name:
BDBM50104411
Synonyms:
(R)-6-Methyl-tetrahydro-thiopyran-2,3,4,5-tetraol | CHEMBL313531
Type:
Small organic molecule
Emp. Form.:
C6H12O4S
Mol. Mass.:
180.222
SMILES:
CC1SC(O)C(O)[C@H](O)C1O
: