Target
Leukotriene B4 receptor 1
Ligand
BDBM81519
Substrate
Meas. Tech.
ChEBML_98512
Ki
77±n/a nM
Citation
 Scott Sawyer, JBaldwin, RFFroelich, LLSaussy, DLJackson, WT Synthesis and pharmacologic activity of hydroxyacetophenone-substituted benzophenone/xanthone leukotriene B4 receptor antagonists Bioorg Med Chem Lett 3:1981-1984 (1993)    Article 
Target
Name:
Leukotriene B4 receptor 1
Synonyms:
BLT BLTR Chemoattractant receptor-like 1 GPR16 LTB4-R 1 Leukotriene B4 R1 Leukotriene B4 receptor 1 P2Y purinoceptor 7 | P2Y7
Type:
Enzyme Catalytic Domain
Mol. Mass.:
37582.68
Organism:
Homo sapiens (Human)
Description:
Q15722
Residue:
352
  
Inhibitor
Name:
BDBM81519
Synonyms:
CAS_117690-79-6 CHEMBL15766 | LY 255283
Type:
Small organic molecule
Emp. Form.:
C19H28N4O3
Mol. Mass.:
360.4506
SMILES:
CCc1cc(C(C)=O)c(O)cc1OCCCCCC(C)(C)c1nnn[nH]1
: