Target
Cholecystokinin receptor type A
Ligand
BDBM50281737
Substrate
Meas. Tech.
ChEBML_47653
Ki
350±n/a nM
Citation
 Hill, DHorwell, DHunter, JKneen, CPritchard, MSuman-Chauhan, N Synthesis of a potent and selective non-peptide CCK-B/gastrin receptor antagonist tritiated ligand. Bioorg Med Chem Lett 3:885-888 (1993)    Article 
Target
Name:
Cholecystokinin receptor type A
Synonyms:
CCKAR_RAT Cholecystokinin peripheral Cholecystokinin receptor type A
Type:
Enzyme Catalytic Domain
Mol. Mass.:
49676.37
Organism:
RAT
Description:
Cholecystokinin central 0 RAT::P30551
Residue:
444
  
Inhibitor
Name:
BDBM50281737
Synonyms:
(R)-3-[(R)-2-(Adamantan-2-yloxycarbonylamino)-3-(1H-indol-3-yl)-2-methyl-propionylamino]-4-(4-amino-phenyl)-butyric acid PD-140376
Type:
Small organic molecule
Emp. Form.:
C33H40N4O5
Mol. Mass.:
572.6945
SMILES:
C[C@](Cc1c[nH]c2ccccc12)(NC(=O)OC1C2CC3CC(C2)CC1C3)C(=O)N[C@@H](CC(O)=O)Cc1ccc(N)cc1
: