Target
Angiotensin-converting enzyme 2
Ligand
BDBM50283648
Substrate
Meas. Tech.
ChEMBL_35588 (CHEMBL876577)
IC50
100±n/a nM
Citation
 De Lombaert, STan, JStamford, LJSakane, YBerry, CGhai, RD Dual inhibition of neutral endopeptidase and angiotensin-converting enzyme by N-phosphonomethyl and N-carboxyalkyl dipeptides Bioorg Med Chem Lett 4:2715-2720 (1994)    Article 
Target
Name:
Angiotensin-converting enzyme 2
Synonyms:
ACEI-ACE2 | Angiotensin-converting enzyme
Type:
Mol. Mass.:
Description:
ASSAY_ID of EBI is 35589
Components:
This complex has 2 components.
Component 1
Name:
Angiotensin-converting enzyme
Synonyms:
ACE Angiotensin converting enzyme (ACE) Angiotensin-converting enzyme, soluble form CD_antigen=CD143 DCP1 Kininase II
Type:
Enzyme
Mol. Mass.:
149709.01
Organism:
Homo sapiens (Human)
Description:
Residue:
1306
  
Component 2
Name:
Angiotensin-converting enzyme 2
Synonyms:
ACE-related carboxypeptidase ACE2_HUMAN Angiotensin-converting enzyme homolog Metalloprotease MPROT15
Type:
Enzyme
Mol. Mass.:
92448.86
Organism:
Homo sapiens (Human)
Description:
Residue:
805
  
Inhibitor
Name:
BDBM50283648
Synonyms:
(S)-2-[(S)-3-Methyl-2-(phosphonomethyl-amino)-butyrylamino]-4-phenyl-butyric acid | CHEMBL93562
Type:
Small organic molecule
Emp. Form.:
C16H25N2O6P
Mol. Mass.:
372.3533
SMILES:
CC(C)[C@H](NCP(O)(O)=O)C(=O)N[C@@H](CCc1ccccc1)C(O)=O
: