Target
Neuromedin-K receptor
Ligand
BDBM50050642
Substrate
Meas. Tech.
ChEMBL_209543 (CHEMBL872641)
IC50
40±n/a nM
Citation
 Boden, PEden, JHodgson, JHorwell, DPritchard, MRaphy, JSuman-Chauhan, N The development of a novel series of non-peptide tachykinin NK3 receptor selective antagonists Bioorg Med Chem Lett 5:1773-1778 (1995)    Article 
Target
Name:
Neuromedin-K receptor
Synonyms:
NK-3 receptor NK3R NKR Neurokinin B receptor Neuromedin-3 receptor (NK-3R) Neuromedin-K receptor Neuromedin-K receptor (NK3) TAC3R Tachykinin receptor 3 | Tachykinin receptor 3 (NK3)
Type:
Enzyme
Mol. Mass.:
52221.96
Organism:
Homo sapiens (Human)
Description:
P29371
Residue:
465
  
Inhibitor
Name:
BDBM50050642
Synonyms:
CHEMBL296014 | {(S)-1-[(R)-1-(8-Hydroxy-octylcarbamoyl)-1-methyl-2-phenyl-ethylcarbamoyl]-2-phenyl-ethyl}-carbamic acid tert-butyl ester
Type:
Small organic molecule
Emp. Form.:
C32H47N3O5
Mol. Mass.:
553.7327
SMILES:
CC(C)(C)OC(=O)N[C@@H](Cc1ccccc1)C(=O)N[C@](C)(Cc1ccccc1)C(=O)NCCCCCCCCO
: