Target
Gamma-aminobutyric acid type B receptor subunit 1/2
Ligand
BDBM50211642
Substrate
Meas. Tech.
ChEBML_68431
EC50
500000±n/a nM
Citation
 Murata, YWoodward, RMMiledi, ROverman, LE The first selective antagonist for a GABAC receptor Bioorg Med Chem Lett 6:2073-2076 (1996)    Article 
Target
Name:
Gamma-aminobutyric acid type B receptor subunit 1/2
Synonyms:
GABA B receptor | GABA-B receptor 1/2
Type:
Mol. Mass.:
Description:
ASSAY_ID of EBI is 68556
Components:
This complex has 2 components.
Component 1
Name:
Gamma-aminobutyric acid type B receptor subunit 1
Synonyms:
GABA B GABA uptake GABA-B-R1 GABABR1 Gabbr1 | Gb1
Type:
Enzyme Catalytic Domain
Mol. Mass.:
111548.69
Organism:
Rattus norvegicus (Rat)
Description:
Q9Z0U4
Residue:
991
  
Component 2
Name:
Gamma-aminobutyric acid type B receptor subunit 2
Synonyms:
GABA B receptor Gabbr2 | Gpr51
Type:
PROTEIN
Mol. Mass.:
105775.46
Organism:
Rattus norvegicus
Description:
O88871
Residue:
940
  
Inhibitor
Name:
BDBM50211642
Synonyms:
CHEMBL397209 methyl(1,2,3,6-tetrahydropyridin-4-yl)phosphinic acid
Type:
Small organic molecule
Emp. Form.:
C6H12NO2P
Mol. Mass.:
161.1387
SMILES:
CP(O)(=O)C1=CCNCC1
: