Target
Adenosine receptor A1
Ligand
BDBM25400
Substrate
Meas. Tech.
ChEBML_29594
EC50
0.190000±n/a nM
Citation
 Scammells, PBaker, SBellardinelli, LOlsson, RRussell, RKnevitt, S The design and synthesis of novel adenosine agonists Bioorg Med Chem Lett 6:811-814 (1996)    Article 
Target
Name:
Adenosine receptor A1
Synonyms:
A1 adenosine receptor (hA1) AA1R_HUMAN ADORA1 Adenosine A1-receptor Adenosine receptor A1 (hA1) | Adenosine transporter (AdT)
Type:
G Protein-Coupled Receptor (GPCR)
Mol. Mass.:
36520.92
Organism:
Homo sapiens (Human)
Description:
P30542
Residue:
326
  
Inhibitor
Name:
BDBM25400
Synonyms:
(2R,3R,4S,5R)-2-[6-(cyclopentylamino)-9H-purin-9-yl]-5-(hydroxymethyl)oxolane-3,4-diol CPA N6-cyclopentyladenosine (CPA) | cid_657378
Type:
Small organic molecule
Emp. Form.:
C15H21N5O4
Mol. Mass.:
335.3583
SMILES:
OC[C@H]1O[C@H]([C@H](O)[C@@H]1O)n1cnc2c(NC3CCCC3)ncnc12
: