Target
Putative inactive group IIC secretory phospholipase A2
Ligand
BDBM50289481
Substrate
Meas. Tech.
ChEMBL_199687 (CHEMBL802916)
IC50
>200000±n/a nM
Citation
 Lee, DMarshall, LABolognese, BAdams, JL Tetrazole is an effective Sn-3 phosphate replacement in substrate analog inhibitors of 14 kDa phospholipase A2 Bioorg Med Chem Lett 7:1427-1432 (1997)    Article 
Target
Name:
Putative inactive group IIC secretory phospholipase A2
Synonyms:
PA2GC_HUMAN Phosphatidylcholine 2-acylhydrolase-like protein GIIC Putative inactive group IIC secretory phospholipase A2
Type:
PROTEIN
Mol. Mass.:
16855.80
Organism:
Homo sapiens (Human)
Description:
ChEMBL_199685
Residue:
149
  
Inhibitor
Name:
BDBM50289481
Synonyms:
CHEMBL34562 | N-(1-Octadecyloxymethyl-4-oxo-pentyl)-acetamide
Type:
Small organic molecule
Emp. Form.:
C26H51NO3
Mol. Mass.:
425.688
SMILES:
(CCC(C)=O)NC(C)=O
: