Target
D(2) dopamine receptor
Ligand
BDBM50290214
Substrate
Meas. Tech.
ChEBML_58455
Ki
3±n/a nM
Citation
 Belliotti, TRKesten, SRRubin, JRWustrow, DJGeorgic, LMZoski, KTAkunne, HCWise, LD Novel cyclohexyl amides as potent and selective D3 dopamine receptor ligands Bioorg Med Chem Lett 7:2403-2408 (1997)    Article 
Target
Name:
D(2) dopamine receptor
Synonyms:
D(2) dopamine receptor DOPAMINE D2 Long DRD2 Dopamine D2 receptor Dopamine D2 receptor (D2R) Dopamine2-like | d2
Type:
Cell-surface receptors
Mol. Mass.:
50647.10
Organism:
Homo sapiens (Human)
Description:
P14416
Residue:
443
  
Inhibitor
Name:
BDBM50290214
Synonyms:
CHEMBL312430 | Furan-2-carboxylic acid (4-{2-[4-(2,3-dichloro-phenyl)-piperazin-1-yl]-ethyl}-cyclohexyl)-amide
Type:
Small organic molecule
Emp. Form.:
C23H29Cl2N3O2
Mol. Mass.:
450.401
SMILES:
Clc1cccc(N2CCN(CC[C@H]3CC[C@@H](CC3)NC(=O)c3ccco3)CC2)c1Cl
: