Target
Delta-type opioid receptor
Ligand
BDBM50290866
Substrate
Meas. Tech.
ChEBML_53570
Ki
2.4±n/a nM
Citation
 Dondio, GRonzoni, SPetrillo, PDesJarlais, RLRaveglia, LF Pyrrolooctahydroisoquinolines as potent and selective opioid receptor ligands: SAR analysis and docking studies Bioorg Med Chem Lett 7:2967-2972 (1997)    Article 
Target
Name:
Delta-type opioid receptor
Synonyms:
DOR-1 MSL-2 OPRD_MOUSE Oprd1
Type:
Enzyme Catalytic Domain
Mol. Mass.:
40577.25
Organism:
MOUSE
Description:
P32300
Residue:
372
  
Inhibitor
Name:
BDBM50290866
Synonyms:
(4aR,8aR)-7-Ethyl-4a-(3-hydroxy-phenyl)-3-methyl-4,4a,5,6,7,8,8a,9-octahydro-1H-pyrrolo[3,2-g]isoquinoline-2-carboxylic acid ethyl ester | CHEMBL322181
Type:
Small organic molecule
Emp. Form.:
C23H30N2O3
Mol. Mass.:
382.4959
SMILES:
CCOC(=O)c1[nH]c2C[C@H]3CN(CC)CC[C@@]3(Cc2c1C)c1cccc(O)c1
: