Target
D(2) dopamine receptor
Ligand
BDBM50366495
Substrate
Meas. Tech.
ChEBML_58464
Ki
0.600000±n/a nM
Citation
 Hegde, VRDai, PLadislaw, CPatel, MGPuar, MSPachter, JA D4 dopamine receptor-selective compounds from the Chinese plant Phoebe chekiangensis Bioorg Med Chem Lett 7:1207-1212 (1997)    Article 
Target
Name:
D(2) dopamine receptor
Synonyms:
D(2) dopamine receptor DOPAMINE D2 Long DRD2 Dopamine D2 receptor Dopamine D2 receptor (D2R) Dopamine2-like | d2
Type:
Cell-surface receptors
Mol. Mass.:
50647.10
Organism:
Homo sapiens (Human)
Description:
P14416
Residue:
443
  
Inhibitor
Name:
BDBM50366495
Synonyms:
(+)butaclamol | CHEMBL1255588
Type:
Small organic molecule
Emp. Form.:
C25H31NO
Mol. Mass.:
361.5197
SMILES:
CC(C)(C)[C@@]1(O)CCN2C[C@@H]3c4ccccc4CCc4cccc([C@H]2C1)c34
: