Target
Prothrombin
Ligand
BDBM50070502
Substrate
Meas. Tech.
ChEMBL_208724 (CHEMBL808504)
IC50
190±n/a nM
Citation
 Bajusz, SFauszt, INémeth, KBarabás, EJuhász, APatthy, M Peptidyl beta-homo-aspartals: specific inhibitors of interleukin-1 beta converting enzyme and its homologues (caspases). Bioorg Med Chem Lett 8:1477-82 (1999)  
Target
Name:
Prothrombin
Synonyms:
Activation peptide fragment 1 Coagulation factor II Prothrombin precursor Thrombin heavy chain | Thrombin light chain
Type:
Protein
Mol. Mass.:
70029.57
Organism:
Homo sapiens (Human)
Description:
P00734
Residue:
622
  
Inhibitor
Name:
BDBM50070502
Synonyms:
((R)-1-Benzyl-2-{(R)-2-[(S)-4-guanidino-1-(2-oxo-ethyl)-butylcarbamoyl]-pyrrolidin-1-yl}-2-oxo-ethyl)-carbamic acid tert-butyl ester | CHEMBL34527
Type:
Small organic molecule
Emp. Form.:
C26H40N6O5
Mol. Mass.:
516.633
SMILES:
CC(C)(C)OC(=O)N[C@H](Cc1ccccc1)C(=O)N1CCC[C@@H]1C(=O)N[C@@H](CCCNC(N)=N)CC=O
: