Target
Sodium-dependent noradrenaline transporter
Ligand
BDBM30130
Substrate
Meas. Tech.
ChEBML_142806
Kd
240±n/a nM
Citation
 Carlier, PRLo, MMLo, PCRichelson, ETatsumi, MReynolds, IJSharma, TA Synthesis of a potent wide-spectrum serotonin-, norepinephrine-, dopamine-reuptake inhibitor (SNDRI) and a species-selective dopamine-reuptake inhibitor based on the gamma-amino alcohol functional group. Bioorg Med Chem Lett 8:487-92 (1999)  
Target
Name:
Sodium-dependent noradrenaline transporter
Synonyms:
Monoamine transporter NET Noradrenaline Transporter (NET) Norepinephrine transporter protein (NET) SLC6A2 Sodium-dependent noradrenaline transporter (NET) | Solute carrier family 6 member 2
Type:
Multi-pass membrane protein
Mol. Mass.:
69337.72
Organism:
Homo sapiens (Human)
Description:
P23975
Residue:
617
  
Inhibitor
Name:
BDBM30130
Synonyms:
CHEMBL1201082 Fluoxetin Prozac cid_62857
Type:
Small organic molecule
Emp. Form.:
C17H18F3NO
Mol. Mass.:
309.3261
SMILES:
CNCCC(Oc1ccc(cc1)C(F)(F)F)c1ccccc1
: