Target
Glutamate receptor ionotropic, NMDA 1
Ligand
BDBM50069491
Substrate
Meas. Tech.
ChEBML_140302
IC50
30±n/a nM
Citation
 Acklin, PAllgeier, HAuberson, YPBischoff, SOfner, SSauer, DSchmutz, M 5-Aminomethylquinoxaline-2,3-diones, Part III: Arylamide derivatives as highly potent and selective glycine-site NMDA receptor antagonists. Bioorg Med Chem Lett 8:493-8 (1999)  
Target
Name:
Glutamate receptor ionotropic, NMDA 1
Synonyms:
Glutamate (NMDA) receptor subunit zeta 1 Glutamate-NMDA-Channel Glutamate-NMDA-Polyamine NMDA Nmdar1 | phencyclidine
Type:
Enzyme Catalytic Domain
Mol. Mass.:
105533.40
Organism:
RAT
Description:
P35439
Residue:
938
  
Inhibitor
Name:
BDBM50069491
Synonyms:
1-(2-Methoxy-phenyl)-3-(7-nitro-2,3-dioxo-1,2,3,4-tetrahydro-quinoxalin-5-ylmethyl)-urea | CHEMBL342804
Type:
Small organic molecule
Emp. Form.:
C17H15N5O6
Mol. Mass.:
385.3309
SMILES:
COc1ccccc1NC(=O)NCc1cc(cc2[n-]c(=[OH+])c(=O)[nH]c12)[N+]([O-])=O
: