Target
Capsid scaffolding protein
Ligand
BDBM50082155
Substrate
Meas. Tech.
ChEBML_158969
IC50
61±n/a nM
Citation
 Smith, DGGribble, ADHaigh, DIfe, RJLavery, PSkett, PSlingsby, BPStacey, RWard, RWWest, A The inhibition of human cytomegalovirus (hCMV) protease by hydroxylamine derivatives. Bioorg Med Chem Lett 9:3137-42 (1999)  
Target
Name:
Capsid scaffolding protein
Synonyms:
APNG Assembly protein Human cytomegalovirus protease (HCMV Pr) Protease precursor UL80 | pPR
Type:
PROTEIN
Mol. Mass.:
73854.16
Organism:
Human cytomegalovirus (strain AD169) (HHV-5) (Human herpesvirus 5)
Description:
ChEMBL_158958
Residue:
708
  
Inhibitor
Name:
BDBM50082155
Synonyms:
4-Hydroxyamino-N-[3-(5-methyl-4-oxo-4H-thieno[2,3-d][1,3]oxazin-2-ylmethyl)-phenyl]-benzamide | CHEMBL108677
Type:
Small organic molecule
Emp. Form.:
C21H17N3O4S
Mol. Mass.:
407.442
SMILES:
Cc1csc2nc(Cc3cccc(NC(=O)c4ccc(NO)cc4)c3)oc(=O)c12
: