Target
Interstitial collagenase
Ligand
BDBM50076992
Substrate
Meas. Tech.
ChEMBL_101758 (CHEMBL709114)
Ki
<1±n/a nM
Citation
 Cherney, RJWang, LMeyer, DTXue, CBArner, ECCopeland, RACovington, MBHardman, KDWasserman, ZRJaffee, BDDecicco, CP Macrocyclic hydroxamate inhibitors of matrix metalloproteinases and TNF-alpha production. Bioorg Med Chem Lett 9:1279-84 (1999)  
Target
Name:
Interstitial collagenase
Synonyms:
CLG MMP1 Matrix metalloproteinase-1 | Matrix metalloproteinase-1 (MMP-1)
Type:
Enzyme
Mol. Mass.:
54010.26
Organism:
Homo sapiens (Human)
Description:
P03956
Residue:
469
  
Inhibitor
Name:
BDBM50076992
Synonyms:
(2S,11S,12R)-7-(4-Amino-benzenesulfonyl)-12-isobutyl-13-oxo-1,7diaza-cyclotridecane-2,11-dicarboxylic acid 11-hydroxyamide 2-methylamide | CHEMBL24347
Type:
Small organic molecule
Emp. Form.:
C24H39N5O6S
Mol. Mass.:
525.661
SMILES:
CNC(=O)[C@@H]1CCCCN(CCC[C@@H]([C@@H](CC(C)C)C(=O)N1)C(=O)NO)S(=O)(=O)c1ccc(N)cc1
: