Target
Sodium-dependent serotonin transporter
Ligand
BDBM50093781
Substrate
Meas. Tech.
ChEMBL_201999 (CHEMBL809444)
Ki
46.0±n/a nM
Citation
 Blough, BEHolmquist, CRAbraham, PKuhar, MJCarroll, FI 3alpha-(4-Substituted phenyl)nortropane-2beta-carboxylic acid methyl esters show selective binding at the norepinephrine transporter. Bioorg Med Chem Lett 10:2445-7 (2001)  
Target
Name:
Sodium-dependent serotonin transporter
Synonyms:
5-HT Transporter 5HT transporter Anandamid membrane transporter, AMT Monoamine transporters; Norepinephrine & serotonin Slc6a4 Sodium-dependent serotonin transporter (SERT) | imipramine receptor
Type:
Multi-pass membrane protein
Mol. Mass.:
70168.43
Organism:
Rattus norvegicus (rat)
Description:
P31652
Residue:
630
  
Inhibitor
Name:
BDBM50093781
Synonyms:
3-p-Tolyl-8-aza-bicyclo[3.2.1]octane CHEMBL80262
Type:
Small organic molecule
Emp. Form.:
C16H21NO2
Mol. Mass.:
259.3434
SMILES:
COC(=O)C1C2CCC(CC1c1ccc(C)cc1)N2
: