Target
Adenosine receptor A1
Ligand
BDBM50085660
Substrate
Meas. Tech.
ChEBML_29424
Ki
>1000±n/a nM
Citation
 Keeling, SEAlbinson, FDAyres, BEButchers, PRChambers, CLCherry, PCEllis, FEwan, GBGregson, MKnight, JMills, KRavenscroft, PReynolds, LHSanjar, SSheehan, MJ The discovery and synthesis of highly potent, A2a receptor agonists. Bioorg Med Chem Lett 10:403-6 (2000)  
Target
Name:
Adenosine receptor A1
Synonyms:
A1 adenosine receptor ADENOSINE A1 ADENOSINE A1 low Adenosine A1 receptor | Adenosine Receptor A1
Type:
Enzyme Catalytic Domain
Mol. Mass.:
36501.39
Organism:
GUINEA PIG
Description:
ADENOSINE A1 ADORA1 GUINEA PIG::P47745
Residue:
326
  
Inhibitor
Name:
BDBM50085660
Synonyms:
(2R,3R,4S,5R)-2-{6-[2-(3-Chloro-phenyl)-ethylamino]-2-cyclopentylamino-purin-9-yl}-5-hydroxymethyl-tetrahydro-furan-3,4-diol | CHEMBL339522
Type:
Small organic molecule
Emp. Form.:
C23H29ClN6O4
Mol. Mass.:
488.967
SMILES:
OC[C@H]1O[C@H]([C@H](O)[C@@H]1O)n1cnc2c(NCCc3cccc(Cl)c3)nc(NC3CCCC3)nc12
: