Target
Adenosine receptor A2a
Ligand
BDBM50085670
Substrate
Meas. Tech.
ChEBML_31973
Ki
2.2±n/a nM
Citation
 Keeling, SEAlbinson, FDAyres, BEButchers, PRChambers, CLCherry, PCEllis, FEwan, GBGregson, MKnight, JMills, KRavenscroft, PReynolds, LHSanjar, SSheehan, MJ The discovery and synthesis of highly potent, A2a receptor agonists. Bioorg Med Chem Lett 10:403-6 (2000)  
Target
Name:
Adenosine receptor A2a
Synonyms:
A2A adenosine receptor (hA2A) ADENOSINE A2 ADORA2 Adenosine A2A receptor (A2AAR)
Type:
G Protein-Coupled Receptor (GPCR)
Mol. Mass.:
44716.46
Organism:
Homo sapiens (Human)
Description:
P29274
Residue:
412
  
Inhibitor
Name:
BDBM50085670
Synonyms:
(2S,3S,4R,5R)-5-(6-Amino-2-cyclopentylamino-purin-9-yl)-3,4-dihydroxy-tetrahydro-furan-2-carboxylic acid ethylamide | CHEMBL340674
Type:
Small organic molecule
Emp. Form.:
C17H25N7O4
Mol. Mass.:
391.4249
SMILES:
CCNC(=O)[C@H]1O[C@H]([C@H](O)[C@@H]1O)n1cnc2c(N)nc(NC3CCCC3)nc12
: