Target
Adenosine receptor A3
Ligand
BDBM50100423
Substrate
Meas. Tech.
ChEMBL_31393 (CHEMBL643651)
EC50
6800±n/a nM
Citation
 Lee, KRavi, GJi, XDMarquez, VEJacobson, KA Ring-Constrained (N)-methanocarba nucleosides as adenosine receptor agonists: independent 5'-uronamide and 2'-deoxy modifications. Bioorg Med Chem Lett 11:1333-7 (2001)  
Target
Name:
Adenosine receptor A3
Synonyms:
A3 adenosine receptor (hA3) ADORA3 | Adenosine A3 receptor (A3AR)
Type:
G Protein-Coupled Receptor (GPCR)
Mol. Mass.:
36197.32
Organism:
Homo sapiens (Human)
Description:
P0DMS8
Residue:
318
  
Inhibitor
Name:
BDBM50100423
Synonyms:
(1S,2R,3S,4R,5S)-2,3-Dihydroxy-4-[6-(3-iodo-benzylamino)-purin-9-yl]-bicyclo[3.1.0]hexane-1-carboxylic acid methylamide CHEMBL280580
Type:
Small organic molecule
Emp. Form.:
C20H21IN6O3
Mol. Mass.:
520.3236
SMILES:
CNC(=O)[C@@]12C[C@@H]1[C@H]([C@H](O)[C@@H]2O)n1cnc2c(NCc3cccc(I)c3)ncnc12
: