Target
Epidermal growth factor receptor
Ligand
BDBM50102091
Substrate
Meas. Tech.
ChEBML_63768
IC50
5±n/a nM
Citation
 Barker, AJGibson, KHGrundy, WGodfrey, AABarlow, JJHealy, MPWoodburn, JRAshton, SECurry, BJScarlett, LHenthorn, LRichards, L Studies leading to the identification of ZD1839 (IRESSA): an orally active, selective epidermal growth factor receptor tyrosine kinase inhibitor targeted to the treatment of cancer. Bioorg Med Chem Lett 11:1911-4 (2001)  
Target
Name:
Epidermal growth factor receptor
Synonyms:
EGF Receptor Substrate EGFR_HUMAN ERBB1 Epidermal Growth Factor Receptor erbB-1 Epidermal growth factor receptor (EGFR) HER1 Proto-oncogene c-ErbB-1 Tyrosine-Protein Kinase ErbB-1
Type:
Receptor Kinase Domain
Mol. Mass.:
134279.59
Organism:
Homo sapiens (Human)
Description:
P00533
Residue:
1210
  
Inhibitor
Name:
BDBM50102091
Synonyms:
1-[4-(3-Chloro-4-fluoro-phenylamino)-7-methoxy-quinazolin-6-yloxy]-3-methylamino-propan-2-ol | CHEMBL56266
Type:
Small organic molecule
Emp. Form.:
C19H20ClFN4O3
Mol. Mass.:
406.839
SMILES:
CNCC(O)COc1cc2c(Nc3ccc(F)c(Cl)c3)ncnc2cc1OC
: