Target
Beta-galactosidase
Ligand
BDBM50104388
Substrate
Meas. Tech.
ChEMBL_39194 (CHEMBL654489)
IC50
370000±n/a nM
Citation
 Robina, IMoreno-Vargas, AJFernández-Bolaños, JGFuentes, JDemange, RVogel, P New leads for selective inhibitors of alpha-L-fucosidases. Synthesis and glycosidase inhibitory activities of [(2R,3S,4R)-3,4-dihydroxypyrrolidin-2-yl]furan derivatives. Bioorg Med Chem Lett 11:2555-9 (2001)  
Target
Name:
Beta-galactosidase
Synonyms:
BGAL_ASPNG | lacA
Type:
PROTEIN
Mol. Mass.:
109138.60
Organism:
Aspergillus niger
Description:
ChEMBL_39387
Residue:
1006
  
Inhibitor
Name:
BDBM50104388
Synonyms:
5-(3,4-Dihydroxy-pyrrolidin-2-yl)-2-methyl-furan-3-carboxylic acid ethyl ester | CHEMBL306321
Type:
Small organic molecule
Emp. Form.:
C12H17NO5
Mol. Mass.:
255.2671
SMILES:
CCOC(=O)c1cc(oc1C)C1NCC(O)C1O
: