Target
Tissue alpha-L-fucosidase
Ligand
BDBM50104391
Substrate
Meas. Tech.
ChEMBL_33964 (CHEMBL649589)
Ki
23400±n/a nM
Citation
 Robina, IMoreno-Vargas, AJFernández-Bolaños, JGFuentes, JDemange, RVogel, P New leads for selective inhibitors of alpha-L-fucosidases. Synthesis and glycosidase inhibitory activities of [(2R,3S,4R)-3,4-dihydroxypyrrolidin-2-yl]furan derivatives. Bioorg Med Chem Lett 11:2555-9 (2001)  
Target
Name:
Tissue alpha-L-fucosidase
Synonyms:
Alpha-L-fucosidase I FUCA1 Tissue alpha-L-fucosidase
Type:
PROTEIN
Mol. Mass.:
53690.69
Organism:
Homo sapiens (Human)
Description:
ChEMBL_34088
Residue:
466
  
Inhibitor
Name:
BDBM50104391
Synonyms:
(R)-1-Benzyl-azepane-3,4,5,6-tetraol | CHEMBL84901
Type:
Small organic molecule
Emp. Form.:
C13H19NO4
Mol. Mass.:
253.2943
SMILES:
OC1CN(Cc2ccccc2)C[C@@H](O)C(O)C1O
: