Target
Tissue alpha-L-fucosidase
Ligand
BDBM50104398
Substrate
Meas. Tech.
ChEBML_34082
Ki
3300±n/a nM
Citation
 Robina, IMoreno-Vargas, AJFernández-Bolaños, JGFuentes, JDemange, RVogel, P New leads for selective inhibitors of alpha-L-fucosidases. Synthesis and glycosidase inhibitory activities of [(2R,3S,4R)-3,4-dihydroxypyrrolidin-2-yl]furan derivatives. Bioorg Med Chem Lett 11:2555-9 (2001)  
Target
Name:
Tissue alpha-L-fucosidase
Synonyms:
Alpha-L-fucosidase I FUCA1 Tissue alpha-L-fucosidase
Type:
PROTEIN
Mol. Mass.:
53690.69
Organism:
Homo sapiens (Human)
Description:
ChEMBL_34088
Residue:
466
  
Inhibitor
Name:
BDBM50104398
Synonyms:
(R)-2-Methyl-6-(4-nitro-phenylsulfanyl)-tetrahydro-thiopyran-3,4,5-triol | CHEMBL314581
Type:
Small organic molecule
Emp. Form.:
C12H15NO5S2
Mol. Mass.:
317.381
SMILES:
CC1SC(Sc2ccc(cc2)[N+]([O-])=O)C(O)[C@H](O)C1O
: