Target
Acetylcholinesterase
Ligand
BDBM50104605
Substrate
Meas. Tech.
ChEMBL_27387 (CHEMBL644292)
IC50
12800±n/a nM
Citation
 Högenauer, KBaumann, KEnz, AMulzer, J Synthesis and acetylcholinesterase inhibition of 5-desamino huperzine A derivatives. Bioorg Med Chem Lett 11:2627-30 (2001)  
Target
Name:
Acetylcholinesterase
Synonyms:
ACES_RAT Acetylcholinesterase and butyrylcholinesterase (AChE and BChE) Acetylcholinesterase, AChE | Ache
Type:
Enzyme
Mol. Mass.:
68193.62
Organism:
Rattus norvegicus (rat)
Description:
P37136
Residue:
614
  
Inhibitor
Name:
BDBM50104605
Synonyms:
13-Eth-(E)-ylidene-11-methyl-6-aza-tricyclo[7.3.1.0*2,7*]trideca-2(7),3,10-trien-5-one | CHEMBL328457
Type:
Small organic molecule
Emp. Form.:
C15H17NO
Mol. Mass.:
227.3016
SMILES:
C\C=C1/C2Cc3[nH]c(=O)ccc3C1CC(C)=C2
: