Target
Reverse transcriptase/RNaseH
Ligand
BDBM50105629
Substrate
Meas. Tech.
ChEMBL_197265 (CHEMBL804181)
EC50
24±n/a nM
Citation
 Wang, DPRizzo, RCTirado-Rives, JJorgensen, WL Antiviral drug design: computational analyses of the effects of the L100I mutation for HIV-RT on the binding of NNRTIs. Bioorg Med Chem Lett 11:2799-802 (2001)  
Target
Name:
Reverse transcriptase/RNaseH
Synonyms:
HIV-1 Reverse Transcriptase RNase H Reverse transcriptase/RNaseH
Type:
PROTEIN
Mol. Mass.:
65229.15
Organism:
Human immunodeficiency virus 1
Description:
ChEMBL_1473730
Residue:
566
  
Inhibitor
Name:
BDBM50105629
Synonyms:
CHEMBL54893 N-{4-chloro-3-[(3-methylbut-2-enyl)oxy]phenyl}-2-methylfuran-3-carbothioamide | UC-781
Type:
Small organic molecule
Emp. Form.:
C17H18ClNO2S
Mol. Mass.:
335.848
SMILES:
[#6]\[#6](-[#6])=[#6]/[#6]-[#8]-c1cc(-[#7]-[#6](=S)-c2ccoc2-[#6])ccc1Cl
: