Target
Acetylcholinesterase
Ligand
BDBM50113648
Substrate
Meas. Tech.
ChEBML_27825
Ki
2050±n/a nM
Citation
 Rajendran, VSaxena, ADoctor, BPKozikowski, AP Synthesis of more potent analogues of the acetylcholinesterase inhibitor, huperzine B. Bioorg Med Chem Lett 12:1521-3 (2002)  
Target
Name:
Acetylcholinesterase
Synonyms:
ACES_BOVIN Acetylcholinesterase (AChE) | Acetylcholinesterase precursor
Type:
Enzyme
Mol. Mass.:
67659.62
Organism:
Bos taurus (bovine)
Description:
Residue:
613
  
Inhibitor
Name:
BDBM50113648
Synonyms:
CHEMBL290113 | Huperzine Analogue
Type:
Small organic molecule
Emp. Form.:
C17H20N2O
Mol. Mass.:
268.3535
SMILES:
CC1=CC2Cc3[nH]c(=O)ccc3C3(C1)NCCC(C)=C23
: