Target
4-hydroxyphenylpyruvate dioxygenase
Ligand
BDBM50088801
Substrate
Meas. Tech.
ChEMBL_550 (CHEMBL615570)
IC50
93300±n/a nM
Citation
 Huang, MYang, DYShang, ZZou, JYu, Q 3D-QSAR studies on 4-hydroxyphenylpyruvate dioxygenase inhibitors by comparative molecular field analysis (CoMFA). Bioorg Med Chem Lett 12:2271-5 (2002)  
Target
Name:
4-hydroxyphenylpyruvate dioxygenase
Synonyms:
HPD | HPPD_PIG
Type:
PROTEIN
Mol. Mass.:
45064.25
Organism:
Sus scrofa
Description:
ChEMBL_541
Residue:
393
  
Inhibitor
Name:
BDBM50088801
Synonyms:
2-Isobutyryl-cyclohexane-1,3-dione CHEMBL72310
Type:
Small organic molecule
Emp. Form.:
C10H14O3
Mol. Mass.:
182.2164
SMILES:
CC(C)C(=O)C1C(=O)CCCC1=O
: