Target
Vasopressin V2 receptor
Ligand
BDBM50108494
Substrate
Meas. Tech.
ChEMBL_211258 (CHEMBL885387)
Ki
95±n/a nM
Citation
 Kakefuda, ATsukada, JKusayama, TTahara, ATsukamoto, S N-Methylbenzanilide derivatives as a novel class of selective V(1A) receptor antagonists. Bioorg Med Chem Lett 12:229-32 (2001)  
Target
Name:
Vasopressin V2 receptor
Synonyms:
AVPR V2 Avpr2 V2R_RAT Vasopressin receptor
Type:
G-protein coupled receptor
Mol. Mass.:
40761.85
Organism:
Rattus norvegicus (Rat)
Description:
Residue:
371
  
Inhibitor
Name:
BDBM50108494
Synonyms:
2-Methyl-furan-3-carboxylic acid (4-{[2-(6-[1,4']bipiperidinyl-1'-yl-6-oxo-hexyloxy)-4-methyl-phenyl]-methyl-carbamoyl}-phenyl)-amide | CHEMBL77105
Type:
Small organic molecule
Emp. Form.:
C37H48N4O5
Mol. Mass.:
628.8008
SMILES:
CN(C(=O)c1ccc(NC(=O)c2ccoc2C)cc1)c1ccc(C)cc1OCCCCCC(=O)N1CCC(CC1)N1CCCCC1
: