Target
Sodium-dependent serotonin transporter
Ligand
BDBM50110578
Substrate
Meas. Tech.
ChEBML_201974
Ki
0.030000±n/a nM
Citation
 Se Lee, BChu, SLee, BSYoon Chi, DSong, YSJin, C Syntheses and binding affinities of 6-nitroquipazine analogues for serotonin transporter. Part 2: 4-substituted 6-nitroquipazines. Bioorg Med Chem Lett 12:811-5 (2002)  
Target
Name:
Sodium-dependent serotonin transporter
Synonyms:
5-HT Transporter 5HT transporter Anandamid membrane transporter, AMT Monoamine transporters; Norepinephrine & serotonin Slc6a4 Sodium-dependent serotonin transporter (SERT) | imipramine receptor
Type:
Multi-pass membrane protein
Mol. Mass.:
70168.43
Organism:
Rattus norvegicus (rat)
Description:
P31652
Residue:
630
  
Inhibitor
Name:
BDBM50110578
Synonyms:
4-Chloro-6-nitro-2-piperazin-1-yl-quinoline | CHEMBL423269
Type:
Small organic molecule
Emp. Form.:
C13H13ClN4O2
Mol. Mass.:
292.721
SMILES:
[O-][N+](=O)c1ccc2nc(cc(Cl)c2c1)N1CCNCC1
: