Target
Prothrombin
Ligand
BDBM50111114
Substrate
Meas. Tech.
ChEBML_208337
Ki
0.160000±n/a nM
Citation
 Lee, KJung, WHPark, CWPark, HDLee, SHKwon, OH Noncovalent tripeptidic thrombin inhibitors incorporating amidrazone, amine and amidine functions at P1. Bioorg Med Chem Lett 12:1017-22 (2002)  
Target
Name:
Prothrombin
Synonyms:
Activation peptide fragment 1 Coagulation factor II Prothrombin precursor Thrombin heavy chain | Thrombin light chain
Type:
Protein
Mol. Mass.:
70029.57
Organism:
Homo sapiens (Human)
Description:
P00734
Residue:
622
  
Inhibitor
Name:
BDBM50111114
Synonyms:
2N-(4-Benzamidinemethyl)-1-[2-Acetylamino-3,3-diphenyl-(2R)-propanoyl]-(2S)-tetrahydro-1H-2-pyrrolecarboxamide;TFA
Type:
Small organic molecule
Emp. Form.:
C30H33N5O3
Mol. Mass.:
511.6147
SMILES:
CC(=O)N[C@H](C(c1ccccc1)c1ccccc1)C(=O)N1CCC[C@H]1C(=O)NCc1ccc(cc1)C(N)=N
: