Target
Glutamate receptor ionotropic, NMDA 1/2B
Ligand
BDBM50451503
Substrate
Meas. Tech.
ChEMBL_141935 (CHEMBL746993)
IC50
1.8±n/a nM
Citation
 Auberson, YPAllgeier, HBischoff, SLingenhoehl, KMoretti, RSchmutz, M 5-Phosphonomethylquinoxalinediones as competitive NMDA receptor antagonists with a preference for the human 1A/2A, rather than 1A/2B receptor composition. Bioorg Med Chem Lett 12:1099-102 (2002)  
Target
Name:
Glutamate receptor ionotropic, NMDA 1/2B
Synonyms:
GluN1/GluN2B NMDA receptor Glutamate [NMDA] receptor subunit epsilon 2/zeta 1 nr2b nam
Type:
Enzyme
Mol. Mass.:
Description:
Components:
This complex has 2 components.
Component 1
Name:
Glutamate receptor ionotropic, NMDA 1
Synonyms:
GRIN1 Glutamate [NMDA] receptor subunit zeta-1 N-methyl-D-aspartate receptor subunit NR1 NMDZ1_HUMAN | phencyclidine
Type:
Enzyme Catalytic Domain
Mol. Mass.:
105397.81
Organism:
Homo sapiens (Human)
Description:
Q05586
Residue:
938
  
Component 2
Name:
Glutamate receptor ionotropic, NMDA 2B
Synonyms:
GRIN2B Glutamate [NMDA] receptor subunit epsilon 2 N-methyl D-aspartate receptor subtype 2B NMDAR2B NR3 | hNR3
Type:
PROTEIN
Mol. Mass.:
166375.46
Organism:
Homo sapiens (Human)
Description:
ChEMBL_1438829
Residue:
1484
  
Inhibitor
Name:
BDBM50451503
Synonyms:
CHEMBL12513
Type:
Small organic molecule
Emp. Form.:
C15H12ClN2O5P
Mol. Mass.:
366.693
SMILES:
Oc1nc2cc(cc(CP(O)(O)=O)c2nc1O)-c1ccc(Cl)cc1
: