Target
Glutamate receptor ionotropic, NMDA 1/2A
Ligand
BDBM50451505
Substrate
Meas. Tech.
ChEMBL_141918 (CHEMBL750561)
IC50
1.1±n/a nM
Citation
 Auberson, YPAllgeier, HBischoff, SLingenhoehl, KMoretti, RSchmutz, M 5-Phosphonomethylquinoxalinediones as competitive NMDA receptor antagonists with a preference for the human 1A/2A, rather than 1A/2B receptor composition. Bioorg Med Chem Lett 12:1099-102 (2002)  
Target
Name:
Glutamate receptor ionotropic, NMDA 1/2A
Synonyms:
Glutamate NMDA receptor; GRIN1/GRIN2A NR1/NR2A
Type:
Protein
Mol. Mass.:
Description:
Components:
This complex has 2 components.
Component 1
Name:
Glutamate receptor ionotropic, NMDA 1
Synonyms:
GRIN1 Glutamate [NMDA] receptor subunit zeta-1 N-methyl-D-aspartate receptor subunit NR1 NMDZ1_HUMAN | phencyclidine
Type:
Enzyme Catalytic Domain
Mol. Mass.:
105397.81
Organism:
Homo sapiens (Human)
Description:
Q05586
Residue:
938
  
Component 2
Name:
Glutamate receptor ionotropic, NMDA 2A
Synonyms:
GRIN2A Glutamate [NMDA] receptor Glutamate [NMDA] receptor subunit epsilon-1 NMDA receptor subtype 2A protein (NR2A) NMDE1_HUMAN hNR2A
Type:
Mol. Mass.:
165293.76
Organism:
Homo sapiens (Human)
Description:
Residue:
1464
  
Inhibitor
Name:
BDBM50451505
Synonyms:
CHEMBL274422
Type:
Small organic molecule
Emp. Form.:
C9H9N2O6P
Mol. Mass.:
272.1513
SMILES:
OC(c1cccc2nc(O)c(O)nc12)P(O)(O)=O
: