Target
Glucocorticoid receptor
Ligand
BDBM50129145
Substrate
Meas. Tech.
ChEBML_71096
IC50
177±n/a nM
Citation
 Zhi, LTegley, CMPio, BEdwards, JPJones, TKMarschke, KBMais, DERisek, BSchrader, WT Synthesis and biological activity of 5-methylidene 1,2-dihydrochromeno[3,4-f]quinoline derivatives as progesterone receptor modulators. Bioorg Med Chem Lett 13:2071-4 (2003)  
Target
Name:
Glucocorticoid receptor
Synonyms:
GCR_HUMAN GRL Glucocorticoid receptor (GRFP) Nuclear receptor subfamily 3 group C member 1
Type:
Enzyme
Mol. Mass.:
85656.87
Organism:
Homo sapiens (Human)
Description:
P04150
Residue:
777
  
Inhibitor
Name:
BDBM50129145
Synonyms:
9-Fluoro-2,2,4-trimethyl-5-((Z)-3-methyl-but-2-enylidene)-2,5-dihydro-1H-6-oxa-1-aza-chrysene | CHEMBL65690
Type:
Small organic molecule
Emp. Form.:
C24H24FNO
Mol. Mass.:
361.4519
SMILES:
[#6]\[#6](-[#6])=[#6]\[#6]=[#6]-1/[#8]-c2ccc(F)cc2-c2ccc3-[#7]C([#6])([#6])[#6]=[#6](-[#6])-c3c-12
: