Target
Estrogen receptor beta
Ligand
BDBM18627
Substrate
Meas. Tech.
ChEMBL_66056 (CHEMBL679024)
IC50
2244±n/a nM
Citation
 Zhi, LRinggenberg, JDEdwards, JPTegley, CMWest, SJPio, BMotamedi, MJones, TKMarschke, KBMais, DESchrader, WT Development of progesterone receptor antagonists from 1,2-dihydrochromeno[3,4-f]quinoline agonist pharmacophore. Bioorg Med Chem Lett 13:2075-8 (2003)  
Target
Name:
Estrogen receptor beta
Synonyms:
Estrogen receptor
Type:
Mol. Mass.:
Description:
ASSAY_ID of ChEMBL is 99778
Components:
This complex has 2 components.
Component 1
Name:
Estrogen receptor beta
Synonyms:
ER-beta ESR2_HUMAN Estradiol receptor beta (ERβ) Estrogen receptor (ER beta) Estrogen receptor beta (ER beta) NR3A2 estrogen beta
Type:
Protein
Mol. Mass.:
59238.43
Organism:
Homo sapiens (Human)
Description:
Q92731
Residue:
530
  
Component 2
Name:
Estrogen receptor
Synonyms:
ER ESR ESR1_HUMAN Estrogen receptor Estrogen receptor (ER-alpha) Estrogen receptor alpha (ER) Nuclear receptor subfamily 3 group A member 1
Type:
Protein
Mol. Mass.:
66230.44
Organism:
Homo sapiens (Human)
Description:
P03372
Residue:
595
  
Inhibitor
Name:
BDBM18627
Synonyms:
(10S,11S,14S,15S,17R)-17-[4-(dimethylamino)phenyl]-14-hydroxy-15-methyl-14-(prop-1-yn-1-yl)tetracyclo[8.7.0.0^{2,7}.0^{11,15}]heptadeca-1,6-dien-5-one Mifepristone RU486 (tetramethyl-rhodamine conjugated)
Type:
Small organic molecule
Emp. Form.:
C29H35NO2
Mol. Mass.:
429.5937
SMILES:
[H][C@@]12CC[C@@](O)(C#CC)[C@@]1(C)C[C@@H](C1=C3CCC(=O)C=C3CC[C@@]21[H])c1ccc(cc1)N(C)C
: