Target
Sodium-dependent noradrenaline transporter
Ligand
BDBM50035738
Substrate
Meas. Tech.
ChEMBL_142613 (CHEMBL751151)
Ki
37±n/a nM
Citation
 Fandrick, KFeng, XJanowsky, AJohnson, RCashman, JR Bivalent biogenic amine reuptake inhibitors. Bioorg Med Chem Lett 13:2151-4 (2003)  
Target
Name:
Sodium-dependent noradrenaline transporter
Synonyms:
Monoamine transporter NET Noradrenaline Transporter (NET) Norepinephrine transporter protein (NET) SLC6A2 Sodium-dependent noradrenaline transporter (NET) | Solute carrier family 6 member 2
Type:
Multi-pass membrane protein
Mol. Mass.:
69337.72
Organism:
Homo sapiens (Human)
Description:
P23975
Residue:
617
  
Inhibitor
Name:
BDBM50035738
Synonyms:
(R)-3-(4-Chloro-phenyl)-8-methyl-8-aza-bicyclo[3.2.1]octane-2-carboxylic acid methyl ester 3-(4-Fluoro-phenyl)-8-methyl-8-aza-bicyclo[3.2.1]octane-2-carboxylic acid methyl ester | CHEMBL306208
Type:
Small organic molecule
Emp. Form.:
C16H20ClNO2
Mol. Mass.:
293.789
SMILES:
COC(=O)C1C2CCC(CC1c1ccc(Cl)cc1)N2C
: