Target
Melanocyte-stimulating hormone receptor
Ligand
BDBM50130011
Substrate
Meas. Tech.
ChEBML_105860
IC50
10000±n/a nM
Citation
 Fotsch, CSmith, DMAdams, JACheetham, JCroghan, MDoherty, EMHale, CJarosinski, MAKelly, MGNorman, MHTamayo, NAXi, NBaumgartner, JW Design of a new peptidomimetic agonist for the melanocortin receptors based on the solution structure of the peptide ligand, Ac-Nle-cyclo[Asp-Pro-DPhe-Arg-Trp-Lys]-NH(2). Bioorg Med Chem Lett 13:2337-40 (2003)  
Target
Name:
Melanocyte-stimulating hormone receptor
Synonyms:
MC1-R Mc1r Melanocyte-stimulating hormone receptor | Msh-r
Type:
PROTEIN
Mol. Mass.:
35238.60
Organism:
Mus musculus
Description:
ChEMBL_1498846
Residue:
315
  
Inhibitor
Name:
BDBM50130011
Synonyms:
(S)-2-Acetylamino-N-(4-{acetyl-[2-(1H-indol-3-yl)-ethyl]-amino}-cyclohexyl)-N-(4-amino-butyl)-3-phenyl-propionamide | CHEMBL307857
Type:
Small organic molecule
Emp. Form.:
C33H45N5O3
Mol. Mass.:
559.7421
SMILES:
CC(=O)N[C@@H](Cc1ccccc1)C(=O)N(CCCCN)C1CCC(CC1)N(CCc1c[nH]c2ccccc12)C(C)=O
: