Target
Sphingosine 1-phosphate receptor 3
Ligand
BDBM50148407
Substrate
Meas. Tech.
ChEBML_201331
IC50
2.7±n/a nM
Citation
 Hale, JJDoherty, GToth, LLi, ZMills, SGHajdu, RAnn Keohane, CRosenbach, MMilligan, JShei, GJChrebet, GBergstrom, JCard, DRosen, HMandala, S The discovery of 3-(N-alkyl)aminopropylphosphonic acids as potent S1P receptor agonists. Bioorg Med Chem Lett 14:3495-9 (2004)  
Target
Name:
Sphingosine 1-phosphate receptor 3
Synonyms:
C9orf108 EDG3 S1P receptor 3 S1P3 S1PR3_HUMAN Sphingosine 1-phosphate receptor 3 (S1P3) | Sphingosine 1-phosphate receptor Edg-3
Type:
G Protein-Coupled Receptor (GPCR)
Mol. Mass.:
42278.13
Organism:
Homo sapiens (Human)
Description:
Q99500
Residue:
378
  
Inhibitor
Name:
BDBM50148407
Synonyms:
(3-Pentadecylamino-propyl)-phosphonic acid | CHEMBL117973
Type:
Small organic molecule
Emp. Form.:
C18H40NO3P
Mol. Mass.:
349.4889
SMILES:
(O)(O)=O
: