Target
Adenosine deaminase
Ligand
BDBM50367032
Substrate
Meas. Tech.
ChEBML_30975
Ki
0.100000±n/a nM
Citation
 Bastian, GBessodes, MPanzica, RPAbushanab, EChen, SFStoeckler, JDParks, RE Adenosine deaminase inhibitors. Conversion of a single chiral synthon into erythro- and threo-9-(2-hydroxy-3-nonyl)adenines. J Med Chem 24:1383-5 (1982)  
Target
Name:
Adenosine deaminase
Synonyms:
ADA ADA_HUMAN | Adenosine aminohydrolase
Type:
Enzyme
Mol. Mass.:
40759.44
Organism:
Homo sapiens (Human)
Description:
Human recombinant ADA was expressed and purified from an ADA-deficient bacterial strain.
Residue:
363
  
Inhibitor
Name:
BDBM50367032
Synonyms:
COFORMYCIN
Type:
Small organic molecule
Emp. Form.:
C11H16N4O5
Mol. Mass.:
284.2685
SMILES:
OC[C@H]1O[C@H]([C@H](O)[C@@H]1O)n1cnc2[C@H](O)CNC=Nc12
: