Target
Adenosine deaminase
Ligand
BDBM50404651
Substrate
Meas. Tech.
ChEBML_30975
Ki
80±n/a nM
Citation
 Bastian, GBessodes, MPanzica, RPAbushanab, EChen, SFStoeckler, JDParks, RE Adenosine deaminase inhibitors. Conversion of a single chiral synthon into erythro- and threo-9-(2-hydroxy-3-nonyl)adenines. J Med Chem 24:1383-5 (1982)  
Target
Name:
Adenosine deaminase
Synonyms:
ADA ADA_HUMAN | Adenosine aminohydrolase
Type:
Enzyme
Mol. Mass.:
40759.44
Organism:
Homo sapiens (Human)
Description:
Human recombinant ADA was expressed and purified from an ADA-deficient bacterial strain.
Residue:
363
  
Inhibitor
Name:
BDBM50404651
Synonyms:
CHEMBL1555103
Type:
Small organic molecule
Emp. Form.:
C14H23N5O
Mol. Mass.:
277.3653
SMILES:
CCCCCC[C@@H]([C@H](C)O)n1cnc2c(N)ncnc12
: