Target
Angiotensin-converting enzyme 2
Ligand
BDBM50027144
Substrate
Meas. Tech.
ChEMBL_36886 (CHEMBL648346)
IC50
5.7±n/a nM
Citation
 Meyer, RFNicolaides, EDTinney, FJLunney, EAHolmes, AHoefle, MLSmith, RDEssenburg, ADKaplan, HRAlmquist, RG Novel synthesis of (S)-1-[5-(benzoylamino)-1,4-dioxo-6-phenylhexyl]-L-proline and analogues: potent angiotensin converting enzyme inhibitors. J Med Chem 24:964-9 (1982)  
Target
Name:
Angiotensin-converting enzyme 2
Synonyms:
ACEI-ACE2 | Angiotensin-converting enzyme
Type:
Mol. Mass.:
Description:
ASSAY_ID of EBI is 35589
Components:
This complex has 2 components.
Component 1
Name:
Angiotensin-converting enzyme
Synonyms:
ACE Angiotensin converting enzyme (ACE) Angiotensin-converting enzyme, soluble form CD_antigen=CD143 DCP1 Kininase II
Type:
Enzyme
Mol. Mass.:
149709.01
Organism:
Homo sapiens (Human)
Description:
Residue:
1306
  
Component 2
Name:
Angiotensin-converting enzyme 2
Synonyms:
ACE-related carboxypeptidase ACE2_HUMAN Angiotensin-converting enzyme homolog Metalloprotease MPROT15
Type:
Enzyme
Mol. Mass.:
92448.86
Organism:
Homo sapiens (Human)
Description:
Residue:
805
  
Inhibitor
Name:
BDBM50027144
Synonyms:
1-(5-Benzoylamino-4-oxo-6-pyridin-3-yl-hexanoyl)-pyrrolidine-2-carboxylic acid | CHEMBL176688
Type:
Small organic molecule
Emp. Form.:
C23H25N3O5
Mol. Mass.:
423.4617
SMILES:
OC(=O)[C@@H]1CCCN1C(=O)CCC(=O)C(Cc1cccnc1)NC(=O)c1ccccc1
: