Target
Adenylate kinase 2, mitochondrial
Ligand
BDBM50010310
Substrate
Meas. Tech.
ChEMBL_32048 (CHEMBL644148)
Ki
60000±n/a nM
Citation
 Hampton, AKappler, FPicker, D Species- or isozyme-specific enzyme inhibitors. 4. Design of a two-site inhibitor of adenylate kinase with isozyme selectivity. J Med Chem 25:638-44 (1982)  
Target
Name:
Adenylate kinase 2, mitochondrial
Synonyms:
2.7.4.3 ATP-AMP transphosphorylase 2 Adenylate kinase 2 Adenylate monophosphate kinase KAD2_RAT
Type:
Mol. Mass.:
26380.21
Organism:
Rattus norvegicus
Description:
Residue:
239
  
Inhibitor
Name:
BDBM50010310
Synonyms:
CHEMBL3251359
Type:
Small organic molecule
Emp. Form.:
C13H22N5O13P3S
Mol. Mass.:
581.326
SMILES:
CCCSc1nc2c(N)ncnc2n1[C@@H]1O[C@H](COP(O)(=O)OP(O)(=O)OP(O)(O)=O)[C@@H](O)[C@H]1O
: