Target
GTP:AMP phosphotransferase AK3, mitochondrial
Ligand
BDBM50222467
Substrate
Meas. Tech.
ChEMBL_32216 (CHEMBL649601)
Ki
45000000±n/a nM
Citation
 Hai, TTPicker, DAbo, MHampton, A Species- or isozyme-specific enzyme inhibitors. 7. Selective effects in inhibitions of rat adenylate kinase isozymes by adenosine 5'-phosphate derivatives. J Med Chem 25:806-12 (1982)  
Target
Name:
GTP:AMP phosphotransferase AK3, mitochondrial
Synonyms:
AK 3 Adenylate kinase 3 alpha like 1 Ak3 Akl3l KAD3_RAT
Type:
PROTEIN
Mol. Mass.:
25443.58
Organism:
Rattus norvegicus
Description:
ChEMBL_1340551
Residue:
227
  
Inhibitor
Name:
BDBM50222467
Synonyms:
8-Bromo-Adenosine Mono Phosphate | CHEMBL1230617
Type:
Small organic molecule
Emp. Form.:
C10H13BrN5O7P
Mol. Mass.:
426.117
SMILES:
Nc1ncnc2n([C@@H]3O[C@H](COP(O)(O)=O)[C@@H](O)[C@H]3O)c(Br)nc12
: