Target
Adenylate kinase 2, mitochondrial
Ligand
BDBM50027448
Substrate
Meas. Tech.
ChEMBL_32050 (CHEMBL644150)
Ki
2100000±n/a nM
Citation
 Hai, TTPicker, DAbo, MHampton, A Species- or isozyme-specific enzyme inhibitors. 7. Selective effects in inhibitions of rat adenylate kinase isozymes by adenosine 5'-phosphate derivatives. J Med Chem 25:806-12 (1982)  
Target
Name:
Adenylate kinase 2, mitochondrial
Synonyms:
2.7.4.3 ATP-AMP transphosphorylase 2 Adenylate kinase 2 Adenylate monophosphate kinase KAD2_RAT
Type:
Mol. Mass.:
26380.21
Organism:
Rattus norvegicus
Description:
Residue:
239
  
Inhibitor
Name:
BDBM50027448
Synonyms:
CHEMBL3143581 | Phosphoric acid mono-[6-(6-amino-purin-9-yl)-2,2-dimethyl-tetrahydro-furo[3,4-d][1,3]dioxol-4-ylmethyl] ester
Type:
Small organic molecule
Emp. Form.:
C13H18N5O7P
Mol. Mass.:
387.2851
SMILES:
CC1(C)O[C@@H]2[C@@H](COP(O)(O)=O)O[C@H]([C@@H]2O1)n1cnc2c(N)ncnc12
: