Target
Sodium-dependent dopamine transporter
Ligand
BDBM50452191
Substrate
Meas. Tech.
ChEBML_184435
Ki
160±n/a nM
Citation
 Maryanoff, BEMcComsey, DFCastanzo, MJSetler, PEGardocki, JFShank, RPSchneider, CR Pyrroloisoquinoline antidepressants. Potent, enantioselective inhibition of tetrabenazine-induced ptosis and neuronal uptake of norepinephrine, dopamine, and serotonin. J Med Chem 27:943-6 (1984)  
Target
Name:
Sodium-dependent dopamine transporter
Synonyms:
DA transporter SC6A3_RAT Sodium-dependent dopamine transporter | Sodium-dependent dopamine transporter (DAT)
Type:
Multi-pass membrane protein
Mol. Mass.:
68749.45
Organism:
Rattus norvegicus (rat)
Description:
P23977
Residue:
619
  
Inhibitor
Name:
BDBM50452191
Synonyms:
CHEMBL2093943
Type:
Small organic molecule
Emp. Form.:
C18H20ClN
Mol. Mass.:
285.811
SMILES:
Cl.[H][C@@]12CCCN1C[C@H](c1ccccc1)c1ccccc21
: