Target
cGMP-dependent 3',5'-cyclic phosphodiesterase
Ligand
BDBM50241379
Substrate
Meas. Tech.
ChEBML_155548
IC50
520000±n/a nM
Citation
 Weishaar, RECain, MHBristol, JA A new generation of phosphodiesterase inhibitors: multiple molecular forms of phosphodiesterase and the potential for drug selectivity. J Med Chem 28:537-45 (1985)  
Target
Name:
cGMP-dependent 3',5'-cyclic phosphodiesterase
Synonyms:
CGS-PDE Homo sapiens phosphodiesterase 2A (PDE2A) PDE2A cGSPDE
Type:
Enzyme Catalytic Domain
Mol. Mass.:
105691.58
Organism:
Homo sapiens (Human)
Description:
O00408
Residue:
941
  
Inhibitor
Name:
BDBM50241379
Synonyms:
(enoximone)4-Methyl-5-(4-methylsulfanyl-benzoyl)-1,3-dihydro-imidazol-2-one 4-Methyl-5-(4-methylsulfanyl-benzoyl)-1,3-dihydro-imidazol-2-one (Enoximone) 4-Methyl-5-(4-methylsulfanyl-benzoyl)-1,3-dihydro-imidazol-2-one(fenoximone, MDL-17043) CHEMBL249856 MDL-17043
Type:
Small organic molecule
Emp. Form.:
C12H12N2O2S
Mol. Mass.:
248.301
SMILES:
CSc1ccc(cc1)C(=O)c1[nH]c(=O)[nH]c1C
: