Target
Adenosine receptor A1
Ligand
BDBM50367273
Substrate
Meas. Tech.
ChEBML_29631
Ki
2.5±n/a nM
Citation
 Jacobson, KAKirk, KLPadgett, WLDaly, JW Functionalized congeners of adenosine: preparation of analogues with high affinity for A1-adenosine receptors. J Med Chem 28:1341-6 (1985)  
Target
Name:
Adenosine receptor A1
Synonyms:
AA1R_RAT ADENOSINE A1 high Adenosine A1 receptor (A1) Adenosine receptors A1 | Adora1
Type:
Protein
Mol. Mass.:
36704.13
Organism:
Rattus norvegicus (rat)
Description:
Residue:
326
  
Inhibitor
Name:
BDBM50367273
Synonyms:
CHEMBL605042
Type:
Small organic molecule
Emp. Form.:
C17H19N5O4
Mol. Mass.:
357.3639
SMILES:
Cc1ccc(Nc2ncnc3n(cnc23)C2O[C@H](CO)[C@@H](O)[C@H]2O)cc1
: