Target
Adenosine receptor A1
Ligand
BDBM50367279
Substrate
Meas. Tech.
ChEBML_29631
Ki
4.5±n/a nM
Citation
 Jacobson, KAKirk, KLPadgett, WLDaly, JW Functionalized congeners of adenosine: preparation of analogues with high affinity for A1-adenosine receptors. J Med Chem 28:1341-6 (1985)  
Target
Name:
Adenosine receptor A1
Synonyms:
AA1R_RAT ADENOSINE A1 high Adenosine A1 receptor (A1) Adenosine receptors A1 | Adora1
Type:
Protein
Mol. Mass.:
36704.13
Organism:
Rattus norvegicus (rat)
Description:
Residue:
326
  
Inhibitor
Name:
BDBM50367279
Synonyms:
CHEMBL604629
Type:
Small organic molecule
Emp. Form.:
C37H40N8O8
Mol. Mass.:
724.7623
SMILES:
OC[C@H]1OC([C@H](O)[C@@H]1O)n1cnc2c(Nc3ccc(CC(=O)Nc4ccc(CC(=O)NCCNC(=O)CCc5ccc(O)cc5)cc4)cc3)ncnc12
: