Target
D(2) dopamine receptor
Ligand
BDBM55121
Substrate
Meas. Tech.
ChEBML_62864
Ki
15±n/a nM
Citation
 Rollema, HMastebroek, DWikström, HSvensson, KCarlsson, ASundell, S Enantiomers of 3-(3,4-dihydroxyphenyl)- and 3-(3-hydroxyphenyl)-N-n-propylpiperidine: central pre- and postsynaptic dopaminergic effects and pharmacokinetics. J Med Chem 29:1889-95 (1986)  
Target
Name:
D(2) dopamine receptor
Synonyms:
DOPAMINE D2 DOPAMINE D2 Short Dopamine D2 receptor Drd2
Type:
G Protein-Coupled Receptor (GPCR)
Mol. Mass.:
50931.60
Organism:
Rattus norvegicus (rat)
Description:
P61169
Residue:
444
  
Inhibitor
Name:
BDBM55121
Synonyms:
3-HYDROXYTYRAMINE HYDROCHLORIDE 4-(2-aminoethyl)pyrocatechol;hydrochloride Dopamine SMR000059081 | cid_65340
Type:
Small organic molecule
Emp. Form.:
C8H11NO2
Mol. Mass.:
153.1784
SMILES:
NCCc1ccc(O)c(O)c1
: