Target
Cathepsin D
Ligand
BDBM50025533
Substrate
Meas. Tech.
ChEBML_45141
Ki
3.7±n/a nM
Citation
 Agarwal, NSRich, DH Inhibition of cathepsin D by substrate analogues containing statine and by analogues of pepstatin. J Med Chem 29:2519-24 (1987)  
Target
Name:
Cathepsin D
Synonyms:
CATD_BOVIN | CTSD
Type:
PROTEIN
Mol. Mass.:
42158.92
Organism:
Bos taurus
Description:
ChEMBL_1458606
Residue:
387
  
Inhibitor
Name:
BDBM50025533
Synonyms:
3-Hydroxy-6-methyl-4-{3-methyl-2-[3-methyl-2-(3-methyl-butyrylamino)-butyrylamino]-butyrylamino}-heptanoic acid [1-(3-methyl-butylcarbamoyl)-ethyl]-amide | CHEMBL164635
Type:
Small organic molecule
Emp. Form.:
C31H59N5O6
Mol. Mass.:
597.8301
SMILES:
CC(C)CCNC(=O)[C@H](C)NC(=O)C[C@H](O)[C@H](CC(C)C)NC(=O)[C@@H](NC(=O)[C@@H](NC(=O)CC(C)C)C(C)C)C(C)C
: